https://w3id.org/np/RA2Srr5VmsB7yv0g0lHa0XYfnXsG1x1glmwhuGihoJAT4
type: Nanopublication
has assertion: assertion
has provenance: provenance
has publication info: pubinfo
created: 2026-08-11T19:10:12Z
creator: 0000-0001-8888-635X
creator: https://orcid.org/0000-0002-1267-0234
creator: https://orcid.org/0000-0003-2195-3997
license: https://creativecommons.org/publicdomain/zero/1.0/
introduces: Reference FAIR Implementation Profile

Reference FAIR Implementation Profile
type: Class
subclass of: FAIR-Implementation-Profile
definition: A list of recommended FAIR Enabling Resources intended to implement the FAIR Guiding Principles, made as a collective decision by the members of a particular community of practice.

sig
has algorithm: RSA
signed by: https://orcid.org/0000-0002-1267-0234