https://w3id.org/np/RA6K7oF0XP9p_OEffDrhg61XQG0GkRoZTrLO74YM5ZV60
created: 2026-08-11T19:04:52Z
creator: 0000-0001-8888-635X
creator: https://orcid.org/0000-0002-1267-0234
creator: https://orcid.org/0000-0003-2195-3997
license: https://creativecommons.org/publicdomain/zero/1.0/
introduces: Metadata preservation policy
type: Nanopublication
has assertion: assertion
has provenance: provenance
has publication info: pubinfo

sig
has algorithm: RSA
signed by: https://orcid.org/0000-0002-1267-0234

Metadata preservation policy
type: Class
subclass of: FAIR-Data-Policy
subclass of: FAIR-Enabling-Resource
definition: A data policy that describes the conditions under which metadata should be provided in the future.
enables: A2