https://w3id.org/np/RA8wBkKlF1jBvaG5owmtkL7pfkKNmNf9RLwpFgYwih17Y
type: Nanopublication
has assertion: assertion
has provenance: provenance
has publication info: pubinfo
created: 2026-08-11T19:04:52Z
creator: 0000-0001-8888-635X
creator: https://orcid.org/0000-0002-1267-0234
creator: https://orcid.org/0000-0003-2195-3997
license: https://creativecommons.org/publicdomain/zero/1.0/
introduces: FAIR Implementation Profile
supersedes: RA2kEiTsJZy CBo1wilelRFv d4dHHIt dctXKZs01G6A

FAIR Implementation Profile
type: Class
subclass of: FAIR-Enabling-Resource
subclass of: FAIR-Specification
definition: A FAIR Implementation Profile (FIP) is a list of declared technology choices intended to implement each of the FAIR Guiding Principles, made as a collective decision by the members of a particular community of practice.
enables: R1.3

sig
has algorithm: RSA
signed by: https://orcid.org/0000-0002-1267-0234