Property: has method
has assertion: assertion
has provenance: provenance
has publication info: pubinfo
type: Nanopublication
created: 2026-07-03T08:28:47Z
creator: https://orcid.org/0000-0002-1267-0234
license: https://creativecommons.org/licenses/by/4.0/
introduces: has method

has method
type: Property
type: ObjectProperty
domain: Project
range: Method
definition: Connects a project with a method created, developed or used in the project.

sig
has algorithm: RSA
signed by: https://orcid.org/0000-0002-1267-0234