https://w3id.org/np/RAAPSh77l7wV0AI6hT10NflGZIFnI45FhqcuIZPaLeYK8
has assertion: assertion
has provenance: provenance
has publication info: pubinfo
type: Nanopublication
created: 2026-06-29T10:38:01.861Z
creator: roberto pizzolotto
license: https://creativecommons.org/licenses/by-sa/4.0/
introduces: has breeding type
was created at: nanodash.knowledgepixels.com
type: BiodivNanopub

has breeding type
part of: ontology
type: Property
type: ObjectProperty
domain: Q16521
range: Breeding time
definition: Links an insect taxon to a breeding type

Q16521
has label from api: taxon - group of one or more organism(s), which a taxonomist adjudges to be a unit

sig
has algorithm: RSA
signed by: roberto pizzolotto

Breeding time
has label from api: Breeding time - This class is used to group together different reproduction rhythms of Carabidae