https://w3id.org/np/RABGJ7foxOUwbpnX4qcYiewS_jUr6zOm7uxIxDtfIqfug
type: Nanopublication
has assertion: assertion
has provenance: provenance
has publication info: pubinfo
created: 2026-08-11T19:04:52Z
creator: 0000-0001-8888-635X
creator: https://orcid.org/0000-0002-1267-0234
creator: https://orcid.org/0000-0003-2195-3997
license: https://creativecommons.org/publicdomain/zero/1.0/
introduces: Crosswalk

Crosswalk
type: Class
subclass of: FAIR-Specification
definition: A specification consisting of a set of rules that define how (meta)data elements or attributes from one schema can be aligned and mapped to (meta)data elements or attributes in another schema that share the same constraints and thus share the same semantic role.
supports: I3

sig
has algorithm: RSA
signed by: https://orcid.org/0000-0002-1267-0234