https://w3id.org/np/RABrhuneLg0rN7mYzCTUXA7Rft-CElcSyd12YHrGG2zxQ
has assertion: assertion
has provenance: provenance
has publication info: pubinfo
type: Nanopublication
created: 2026-07-27T11:53:24.124+02:00
creator: Tobias Kuhn
license: https://creativecommons.org/publicdomain/zero/1.0/
introduces: covers agent
was created at: localhost:37373

covers agent
is part of: GeneralNanopubEcosystemOntology
type: Property
type: ObjectProperty
domain: FAIRCompendiumOfContributedKnowledge
range: Agent
definition: Links a FAIR Compendium of Contributed Knowledge to the agent whose contributions it covers

FAIRCompendiumOfContributedKnowledge
has label from api: FAIR Compendium of Contributed Knowledge - A FAIR Compendium of Contributed Knowledge consists of a complete set of nano...

sig
has algorithm: RSA
signed by: Tobias Kuhn