FAIR Analysis Service
type: Class
is part of: FIP-Ontology
subclass of: FAIR-Supporting-Resource
subclass of: FAIR-Supporting-Technology
definition: An online resource that executes analytical workflows by natively consuming or generating FAIR Digital Objects.
supports: R1.3

https://w3id.org/np/RAE0JkQNmv0K5KEuas0NLYnrnxRzjzbus4x-B4qWpg5iU
type: Nanopublication
has assertion: assertion
has provenance: provenance
has publication info: pubinfo
created: 2026-08-11T19:04:52Z
creator: https://orcid.org/0000-0002-1267-0234
license: https://creativecommons.org/publicdomain/zero/1.0/
introduces: FAIR Analysis Service

sig
has algorithm: RSA
signed by: https://orcid.org/0000-0002-1267-0234