https://w3id.org/np/RAE30jcDYYw_ymztvLis8Ol95kAbsjxMbaebVCrJivFZw
has assertion: assertion
has provenance: provenance
has publication info: pubinfo
type: Nanopublication
created: 2026-08-11T19:04:52Z
creator: 0000-0001-8888-635X
creator: https://orcid.org/0000-0002-1267-0234
creator: https://orcid.org/0000-0003-2195-3997
license: https://creativecommons.org/publicdomain/zero/1.0/
introduces: Persistency Policy

Persistency Policy
type: Class
subclass of: FAIR-Data-Policy
subclass of: FAIR-Enabling-Resource
definition: A policy with respect to persistency of resources.
enables: A2
enables: F1
enables: F4

sig
has algorithm: RSA
signed by: https://orcid.org/0000-0002-1267-0234