Property: has data steward
has assertion: assertion
has provenance: provenance
has publication info: pubinfo
type: Nanopublication
created: 2026-08-11T07:50:39Z
creator: Tobias Kuhn
license: https://creativecommons.org/licenses/by/4.0/
introduces: has data steward

has data steward
type: Property
type: ObjectProperty
domain: Project
range: Person
definition: Connects a project with a person responsible for the management and stewardship of its data, including its FAIRness.

sig
has algorithm: RSA
signed by: Tobias Kuhn