https://w3id.org/np/RAFH7ETic09sslHqQmd1mY3bqA9U4In13FnHyhkxbEPZI
created: 2026-08-11T19:10:12Z
creator: 0000-0001-8888-635X
creator: https://orcid.org/0000-0002-1267-0234
creator: https://orcid.org/0000-0003-2195-3997
license: https://creativecommons.org/publicdomain/zero/1.0/
introduces: FAIR training material
type: Nanopublication
has assertion: assertion
has provenance: provenance
has publication info: pubinfo

sig
has algorithm: RSA
signed by: https://orcid.org/0000-0002-1267-0234

FAIR training material
type: Class
subclass of: FAIR-Supporting-Resource
definition: Any educational resource (such as the content or its published representation in text, presentation graphics, or video) that covers FAIR topics of interest.