https://w3id.org/np/RAHwOcshpXj9gChfMKzGYrzHaPOfUj0_6N3nSWw4njiFw
has assertion: assertion
has provenance: provenance
has publication info: pubinfo
type: Nanopublication
created: 2026-08-11T17:48:16Z
creator: 0000-0001-8888-635X
creator: https://orcid.org/0000-0002-1267-0234
creator: https://orcid.org/0000-0003-2195-3997
license: https://creativecommons.org/publicdomain/zero/1.0/
introduces: FAIR Representation Service

FAIR Representation Service
type: Class
subclass of: FAIR-Supporting-Technology
definition: A transformation service that converts non-FAIR data into a FAIR representation using machine-readable knowledge representation languages.
supports: I1

sig
has algorithm: RSA
signed by: https://orcid.org/0000-0002-1267-0234