Property: has project leader
type: Nanopublication
has assertion: assertion
has provenance: provenance
has publication info: pubinfo
created: 2026-08-11T07:50:39Z
creator: Tobias Kuhn
license: https://creativecommons.org/licenses/by/4.0/
introduces: has project leader

has project leader
type: Property
type: ObjectProperty
domain: Project
range: Person
definition: Connects a project with the person responsible for leading and coordinating its day-to-day execution, which may be someone other than the principal investigator.

sig
has algorithm: RSA
signed by: Tobias Kuhn