https://w3id.org/np/RAKQ6i8uTZb3HcQANrkXi0ITPAUSl01EiX9-rwY3NGz8I
created: 2026-08-11T19:04:52Z
creator: https://orcid.org/0000-0002-1267-0234
license: https://creativecommons.org/publicdomain/zero/1.0/
introduces: FAIR Enrichment Service
type: Nanopublication
has assertion: assertion
has provenance: provenance
has publication info: pubinfo

sig
has algorithm: RSA
signed by: https://orcid.org/0000-0002-1267-0234

FAIR Enrichment Service
type: Class
is part of: FIP-Ontology
subclass of: FAIR-Supporting-Resource
subclass of: FAIR-Supporting-Technology
definition: An online resource that enhances the FAIRness of existing resources through AI software or other techniques with suggested semantic metadata and mappings.
supports: R1.3