https://w3id.org/np/RAOtNAprqxSbxcufVSpQ4IZ0eJFgaynLtHS5lmafQaiYk
type: Nanopublication
has assertion: assertion
has provenance: provenance
has publication info: pubinfo
created: 2026-08-11T19:10:12Z
creator: 0000-0001-8888-635X
creator: https://orcid.org/0000-0002-1267-0234
creator: https://orcid.org/0000-0003-2195-3997
license: https://creativecommons.org/publicdomain/zero/1.0/
introduces: FAIR data stewardship event

FAIR data stewardship event
type: Class
subclass of: FAIR-Supporting-Resource
definition: A meeting specifically designed for current or aspiring data stewards to provide a rigorous understanding of the FAIR principles from theory to their concrete implementation.

sig
has algorithm: RSA
signed by: https://orcid.org/0000-0002-1267-0234