FSR Declaration
type: Class
subclass of: FAIR-Declaration
definition: The statement of a community on the usage of a FAIR Supporting Resource.

https://w3id.org/np/RAP1U4Ed4vVnqxOyTrgtW362baoHNs2kmeFN4y4FquMg4
type: Nanopublication
has assertion: assertion
has provenance: provenance
has publication info: pubinfo
created: 2026-08-11T19:10:12Z
creator: 0000-0001-8888-635X
creator: https://orcid.org/0000-0002-1267-0234
creator: https://orcid.org/0000-0003-2195-3997
license: https://creativecommons.org/publicdomain/zero/1.0/
introduces: FSR Declaration

sig
has algorithm: RSA
signed by: https://orcid.org/0000-0002-1267-0234