https://w3id.org/np/RAQ1OhBnu9dNFRwCculucysXzPFw5Vs50qQGoqQGEhE9w
has assertion: assertion
has provenance: provenance
has publication info: pubinfo
type: Nanopublication
created: 2026-08-11T17:48:16Z
creator: https://orcid.org/0000-0002-1267-0234
license: https://creativecommons.org/publicdomain/zero/1.0/
introduces: FAIR Assessment Specification

FAIR Assessment Specification
is part of: FIP-Ontology
type: Class
subclass of: FAIR-Specification
subclass of: FAIR-Supporting-Resource
definition: A specification defining metrics for each FAIR principle, benchmarks (as a collection of metrics), tests and scoring algorithm to assess the FAIRness of a digital object.
supports: R1.3

sig
has algorithm: RSA
signed by: https://orcid.org/0000-0002-1267-0234