Property: has lead institution
has assertion: assertion
has provenance: provenance
has publication info: pubinfo
type: Nanopublication
created: 2026-08-11T07:50:39Z
creator: Tobias Kuhn
license: https://creativecommons.org/licenses/by/4.0/
introduces: has lead institution

has lead institution
type: Property
type: ObjectProperty
domain: Project
range: Organization
definition: Connects a project with the organisation that hosts and coordinates it, i.e. the institution of the main applicant.

sig
has algorithm: RSA
signed by: Tobias Kuhn