https://w3id.org/np/RAQz9XbNIltr4jDWra8ec60AXxQ_H3TlznMSkMjoWDIMo
has assertion: assertion
has provenance: provenance
has publication info: pubinfo
type: Nanopublication
created: 2026-06-29T12:30:08.012Z
creator: Tobias Kuhn
creator: roberto pizzolotto
license: https://creativecommons.org/licenses/by-sa/4.0/
introduces: has morphological character
was created at: nanodash.knowledgepixels.com

has morphological character
part of: ontology
type: Property
type: ObjectProperty
domain: Q16521
range: MorphologicalCharacter
definition: Links a taxon (e.g. species) to one of its morphological characters.

Q16521
has label from api: taxon - group of one or more organism(s), which a taxonomist adjudges to be a unit

MorphologicalCharacter
has label from api: Carabid Morphological Character - A morphological character is a specific, observable physical trait or structu...

sig
has algorithm: RSA
signed by: roberto pizzolotto