https://w3id.org/np/RAX-X347OiM5U1cmj21JCWXkAHzwuVr-0lPFQGdP9qRD8
has assertion: assertion
has provenance: provenance
has publication info: pubinfo
type: Nanopublication
created: 2026-07-31T21:01:36.526Z
creator: Tobias Kuhn
creator: roberto pizzolotto
license: https://creativecommons.org/licenses/by/4.0/
introduces: has distribution range
was created at: nanodash.knowledgepixels.com

has distribution range
is part of: ontology
type: Property
type: ObjectProperty
domain: Q16521
range: Chorotype
definition: Links an organism or taxon to a geographical distribution range (chorotype)

Q16521
has label from api: taxon - group of one or more organism(s), which a taxonomist adjudges to be a unit

sig
has algorithm: RSA
signed by: roberto pizzolotto

Chorotype
has label from api: Chorotype - This term is used to group together similar biogeographical ranges.