https://w3id.org/np/RAYP1Q2KVl2O9pdCh26qx7VVQWZWKT92UR9tnwZbhU2NA
has assertion: assertion
has provenance: provenance
has publication info: pubinfo
type: Nanopublication
created: 2026-08-11T17:48:16Z
creator: 0000-0001-8888-635X
creator: https://orcid.org/0000-0002-1267-0234
creator: https://orcid.org/0000-0003-2195-3997
license: https://creativecommons.org/publicdomain/zero/1.0/
introduces: Provenance model

Provenance model
type: Class
subclass of: FAIR-Enabling-Resource
subclass of: FAIR-Specification
definition: A specification that specifies metadata describing the origin and lineage of data or other digital objects.
enables: R1.2

sig
has algorithm: RSA
signed by: https://orcid.org/0000-0002-1267-0234