https://w3id.org/np/RA_1vGQouR7XD2EYURfe3EQ75BCT60XBd2AljAuunQM2E
type: Nanopublication
has assertion: assertion
has provenance: provenance
has publication info: pubinfo
created: 2026-08-11T19:04:52Z
creator: 0000-0001-8888-635X
creator: https://orcid.org/0000-0002-1267-0234
creator: https://orcid.org/0000-0003-2195-3997
license: https://creativecommons.org/publicdomain/zero/1.0/
introduces: Identifier service

Identifier service
type: Class
subclass of: FAIR-Enabling-Resource
subclass of: FAIR-Supporting-Technology
definition: A service that provides for any digital object (1) algorithms guaranteeing global uniqueness, (2) policy document that guarantees persistent and (3) resolution of the identifier to machine-actionable metadata describing the object and its location.
enables: F1

sig
has algorithm: RSA
signed by: https://orcid.org/0000-0002-1267-0234