https://w3id.org/np/RAaOL8LY01fgjIGvo_lWLgwwoQnbYPJ-kB77ljNvqT3cQ
has assertion: assertion
has provenance: provenance
has publication info: pubinfo
type: Nanopublication
created: 2026-08-11T17:48:16Z
creator: 0000-0001-8888-635X
creator: https://orcid.org/0000-0002-1267-0234
creator: https://orcid.org/0000-0003-2195-3997
license: https://creativecommons.org/publicdomain/zero/1.0/
introduces: Knowledge representation language

Knowledge representation language
type: Class
subclass of: FAIR-Enabling-Resource
subclass of: FAIR-Specification
definition: A language specification that enables knowledge to be processed by machines.
enables: I1

sig
has algorithm: RSA
signed by: https://orcid.org/0000-0002-1267-0234