https://w3id.org/np/RAcabga5hhyAXHTtDaG7lmLOuHo9XZv9ZAivgkKjfgkJw
has assertion: assertion
has provenance: provenance
has publication info: pubinfo
type: Nanopublication
created: 2026-08-11T19:10:12Z
creator: 0000-0001-8888-635X
creator: https://orcid.org/0000-0002-1267-0234
creator: https://orcid.org/0000-0003-2195-3997
license: https://creativecommons.org/publicdomain/zero/1.0/
introduces: FAIR data steward professional profile

FAIR data steward professional profile
type: Class
subclass of: FAIR-Supporting-Resource
definition: A document stating the accumulated training qualifications and FAIR outputs authored by or contributed to, by that person. The profile may be augmented with additional statements regarding professional roles and skills.

sig
has algorithm: RSA
signed by: https://orcid.org/0000-0002-1267-0234