https://w3id.org/np/RAeTRfIMl2Wfyqlz4f7jvm038UVpHZIauF1bia07gFlvw
has assertion: assertion
has provenance: provenance
has publication info: pubinfo
type: Nanopublication
created: 2026-08-11T19:10:12Z
creator: 0000-0001-8888-635X
creator: https://orcid.org/0000-0002-1267-0234
creator: https://orcid.org/0000-0003-2195-3997
license: https://creativecommons.org/publicdomain/zero/1.0/
introduces: FAIR data stewardship plan template

FAIR data stewardship plan template
type: Class
subclass of: FAIR-Supporting-Resource
definition: A template guiding data stewardship including how FAIR Principles should be implemented. The template must be completed with project-specific information in any given instance to outline how data are to be handled in preparation for the project, during the research project, and after the project is completed.

sig
has algorithm: RSA
signed by: https://orcid.org/0000-0002-1267-0234