https://w3id.org/np/RAeqU6y9YB9ZgxGFgN0DVZKdytfgYqkJdea_GrV5AMQZI
type: Nanopublication
has assertion: assertion
has provenance: provenance
has publication info: pubinfo
created: 2026-07-16T15:36:44.817+02:00
creator: Tobias Kuhn
license: https://creativecommons.org/publicdomain/zero/1.0/
introduces: has as helper
was created at: localhost:37373

has as helper
type: Property
type: ObjectProperty
is part of: GeneralNanopubEcosystemOntology
domain: Space
range: Agent
definition: Links a space to an agent (human or artificial) that acts as helper.

Space
has label from api: Space - Spaces are any kind of collaborative and social units, such as groups, events...

sig
has algorithm: RSA
signed by: Tobias Kuhn