Property: has output
created: 2026-07-03T12:09:47Z
creator: https://orcid.org/0000-0002-1267-0234
license: https://creativecommons.org/licenses/by/4.0/
introduces: has output
type: Nanopublication
has assertion: assertion
has provenance: provenance
has publication info: pubinfo

sig
has algorithm: RSA
signed by: https://orcid.org/0000-0002-1267-0234

has output
type: Property
type: ObjectProperty
domain: Project
definition: Connects a project with an output produced or reused in the project, such as an article, dataset, software, method, data management plan, or pre-registration.