https://w3id.org/np/RAgsrw65KSoHxjy8_h7HQDT3zniXD40Tg_RFhpecn2Tq4
has assertion: assertion
has provenance: provenance
has publication info: pubinfo
type: Nanopublication
created: 2026-08-11T19:04:52Z
creator: 0000-0001-8888-635X
creator: https://orcid.org/0000-0002-1267-0234
creator: https://orcid.org/0000-0003-2195-3997
license: https://creativecommons.org/publicdomain/zero/1.0/
introduces: Structured vocabulary

Structured vocabulary
type: Class
subclass of: FAIR-Enabling-Resource
subclass of: FAIR-Specification
definition: A specification for a controlled list of uniquely identified and unambigous concepts with their definitions represented using web standards.
enables: I2

sig
has algorithm: RSA
signed by: https://orcid.org/0000-0002-1267-0234