Editor
type: Class
subclass of: FAIR-Supporting-Technology
definition: A service that provides a user-friendly interface for easy editing of metadata, vocabularies or crosswalks.
supports: F2
supports: I2
supports: I3

https://w3id.org/np/RAijuJ9h-jfOVceGQ7WtZtaTzrCurY9865okKNSQxKLuQ
created: 2026-08-11T17:48:16Z
creator: 0000-0001-8888-635X
creator: https://orcid.org/0000-0002-1267-0234
creator: https://orcid.org/0000-0003-2195-3997
license: https://creativecommons.org/publicdomain/zero/1.0/
introduces: Editor
type: Nanopublication
has assertion: assertion
has provenance: provenance
has publication info: pubinfo

sig
has algorithm: RSA
signed by: https://orcid.org/0000-0002-1267-0234