https://w3id.org/np/RAjmc63m_DChYKtDuLKCQoGsdB57xxu4cGPXCjWbNXjZo
type: Nanopublication
has assertion: assertion
has provenance: provenance
has publication info: pubinfo
created: 2026-08-11T17:48:16Z
creator: https://orcid.org/0000-0002-1267-0234
license: https://creativecommons.org/publicdomain/zero/1.0/
introduces: Integration Service

Integration Service
type: Class
is part of: FIP-Ontology
subclass of: FAIR-Supporting-Resource
subclass of: FAIR-Supporting-Technology
definition: A software interface (e.g., Web-API) that provides a structured, secure, and reliable gateway to connect different systems, allowing users or machines to retrieve, query, consolidate, or interact with data and resources across multiple sources.
supports: A1.1

sig
has algorithm: RSA
signed by: https://orcid.org/0000-0002-1267-0234