FAIR-Enabling Resource
type: Class
subclass of: FAIR-Supporting-Resource
definition: A service, a specification or a data policy that is essential to the operationalization of the FAIR Principles, i.e., puts FAIR into action. A FAIR-Enabling Resource (FER) provides a function needed to achieve some aspect of FAIR behavior and is explicitly linked to one or more FAIR principles.

https://w3id.org/np/RAm3amg4v8p91vjzZQdndkNfERw80oDxGr35W8BEQDh3E
created: 2026-08-11T19:10:12Z
creator: 0000-0001-8888-635X
creator: https://orcid.org/0000-0002-1267-0234
creator: https://orcid.org/0000-0003-2195-3997
license: https://creativecommons.org/publicdomain/zero/1.0/
introduces: FAIR-Enabling Resource
type: Nanopublication
has assertion: assertion
has provenance: provenance
has publication info: pubinfo

sig
has algorithm: RSA
signed by: https://orcid.org/0000-0002-1267-0234