https://w3id.org/np/RAmYwbCQ2YhumDjTcFWs7NL9q7WUO7uYL9wvnHDYK4E90
type: Nanopublication
has assertion: assertion
has provenance: provenance
has publication info: pubinfo
created: 2026-06-29T11:01:56.588Z
creator: Tobias Kuhn
creator: roberto pizzolotto
license: https://creativecommons.org/licenses/by-sa/4.0/
introduces: has morphological character
was created at: nanodash.knowledgepixels.com

Q16521
has label from api: taxon - group of one or more organism(s), which a taxonomist adjudges to be a unit

sig
has algorithm: RSA
signed by: roberto pizzolotto

MorphologicalCharacter
has label from api: Morphological Character - A morphological character is a specific, observable physical trait or structu...

has morphological character
type: Property
type: ObjectProperty
part of: ontology
domain: Q16521
range: MorphologicalCharacter
definition: Links a taxon (e.g. species) to one of its morphological characters.