https://w3id.org/np/RAoUjDY-8W8EOHHg4mTwSzfPHuv8iY1aeB8BPjFFa9A5E
type: Nanopublication
has assertion: assertion
has provenance: provenance
has publication info: pubinfo
created: 2026-08-11T19:04:52Z
creator: 0000-0001-8888-635X
creator: https://orcid.org/0000-0002-1267-0234
creator: https://orcid.org/0000-0003-2195-3997
license: https://creativecommons.org/publicdomain/zero/1.0/
introduces: FAIR practice

FAIR practice
type: Class
subclass of: FAIR-Data-Policy
subclass of: FAIR-Supporting-Resource
definition: A convention for implementing FAIR clarifying the use of resources for a specific goal as defined by a community of practice.
supports: R1.3

sig
has algorithm: RSA
signed by: https://orcid.org/0000-0002-1267-0234