found in
type: Property
type: ObjectProperty
is part of: ontology
domain: Q7432
range: CarabidEcologicalFeature
definition: to define a species collected for the first time in a habitat

https://w3id.org/np/RAsbODWUOTsiuUbyTgHktyfYbkA3G_SYHm27CS5bzMCDY
type: Nanopublication
has assertion: assertion
has provenance: provenance
has publication info: pubinfo
created: 2026-07-25T18:03:01.545Z
creator: roberto pizzolotto
license: https://creativecommons.org/licenses/by-sa/4.0/
introduces: found in
was created at: nanodash.knowledgepixels.com

Q7432
has label from api: species - one of the basic units of biological classification and a taxonomic rank

sig
has algorithm: RSA
signed by: roberto pizzolotto

CarabidEcologicalFeature
has label from api: Carabid Ecological Feature - A ecological feature is a specific feature linked to an adaptation of a carabid