https://w3id.org/np/RAtNLPE5oP3x1b4wVKsj6Tx4G7KwCmrGS4jG73ob64WwU
type: Nanopublication
has assertion: assertion
has provenance: provenance
has publication info: pubinfo
created: 2026-08-11T17:48:16Z
creator: https://orcid.org/0000-0002-1267-0234
license: https://creativecommons.org/publicdomain/zero/1.0/
introduces: Open Digital Rights Language Specification

Open Digital Rights Language Specification
type: Class
is part of: FIP-Ontology
subclass of: FAIR-Specification
subclass of: FAIR-Supporting-Resource
definition: An Open Digital Rights Language (ODRL) specification is a machine-readable expression of permissions, prohibitions, and obligations that governs how a digital asset (such as a dataset, software, or service) can be used.
supports: R1.1

sig
has algorithm: RSA
signed by: https://orcid.org/0000-0002-1267-0234