https://w3id.org/np/RAuea69PEvhDPuSAkAZD4Djo8QQg9GVom75JPeFCzgB08
has assertion: assertion
has provenance: provenance
has publication info: pubinfo
type: Nanopublication
created: 2026-08-11T19:04:52Z
creator: 0000-0001-8888-635X
creator: https://orcid.org/0000-0002-1267-0234
creator: https://orcid.org/0000-0003-2195-3997
license: https://creativecommons.org/publicdomain/zero/1.0/
introduces: Provenance tracking service

Provenance tracking service
type: Class
subclass of: FAIR-Supporting-Technology
definition: A system that systematically captures, stores and manages detailed information about the origin, history, and lifecycle of digital objects creating metadata based on a provenance model.
supports: R1.2

sig
has algorithm: RSA
signed by: https://orcid.org/0000-0002-1267-0234