https://w3id.org/np/RAuxij-rAezAZB5oTzC70zFIIW9RmZB6hh8Dz-u3NEf34
created: 2026-08-11T19:10:12Z
creator: 0000-0001-8888-635X
creator: https://orcid.org/0000-0002-1267-0234
creator: https://orcid.org/0000-0003-2195-3997
license: https://creativecommons.org/publicdomain/zero/1.0/
introduces: Available FAIR-Enabling Resource
type: Nanopublication
has assertion: assertion
has provenance: provenance
has publication info: pubinfo

sig
has algorithm: RSA
signed by: https://orcid.org/0000-0002-1267-0234

Available FAIR-Enabling Resource
type: Class
subclass of: Available-FAIR-Supporting-Resource
subclass of: FAIR-Enabling-Resource
definition: A FAIR-enabling resource that is available for use