has funder
type: Property
type: ObjectProperty
domain: Project
range: Organization
definition: Connects a project with the organisation that funds it.

Property: has funder
type: Nanopublication
has assertion: assertion
has provenance: provenance
has publication info: pubinfo
created: 2026-08-11T07:50:39Z
creator: Tobias Kuhn
license: https://creativecommons.org/licenses/by/4.0/
introduces: has funder

sig
has algorithm: RSA
signed by: Tobias Kuhn