https://w3id.org/np/RAzBgZ1Y7A4aheJfIh53weLGW2W1hWxOclHX_pmw2G-ZU
created: 2026-08-11T19:04:52Z
creator: https://orcid.org/0000-0002-1267-0234
license: https://creativecommons.org/publicdomain/zero/1.0/
introduces: FAIRification Workflow
type: Nanopublication
has assertion: assertion
has provenance: provenance
has publication info: pubinfo

sig
has algorithm: RSA
signed by: https://orcid.org/0000-0002-1267-0234

FAIRification Workflow
type: Class
is part of: FIP-Ontology
subclass of: FAIR-Supporting-Resource
subclass of: FAIR-Supporting-Technology
definition: An exectuable, structured, and repeatable sequence of automated and human steps designed to transform non-FAIR digital objects into fully FAIR Digital Objects using a list of FAIR Supporting Resources.
supports: R1.3