Property: has informal output (and its sub-properties and classes)
type: Nanopublication
has assertion: assertion
has provenance: provenance
has publication info: pubinfo
created: 2026-07-13T06:59:30Z
creator: https://orcid.org/0000-0002-1267-0234
license: https://creativecommons.org/licenses/by/4.0/
introduces: Blog Post
introduces: Discussion
introduces: Informal Output
introduces: Media Article
introduces: Podcast
introduces: Social Media Post
introduces: has blog post
introduces: has discussion
introduces: has informal output
introduces: has media coverage
introduces: has podcast
introduces: has social post

Blog Post
type: Class
subclass of: Informal Output
definition: A blog post on a personal, lab, institutional, or platform blog.

Discussion
type: Class
subclass of: Informal Output
definition: A public discussion, debate contribution, round-table, forum thread, or opinion/commentary piece.

Informal Output
type: Class
definition: A grey, informal, or public-facing output of a project that is not a peer-reviewed or formally published research artifact — such as a blog post, media article, social-media post, podcast, or public discussion — produced by or prominently featuring the people working on the project.

Media Article
type: Class
subclass of: Informal Output
definition: A newspaper, magazine, popular-science, or institutional-news article or interview featuring the project or its people.

Podcast
type: Class
subclass of: Informal Output
definition: A podcast episode or audio programme hosted by or featuring the people working on the project.

Social Media Post
type: Class
subclass of: Informal Output
definition: A microblog or social-media post (e.g. on X, Bluesky, Mastodon, or LinkedIn).

has blog post
type: Property
type: ObjectProperty
domain: Project
range: Blog Post
sub property of: has informal output
definition: Connects a project with a blog post by or about the project or its people.

has discussion
type: Property
type: ObjectProperty
domain: Project
range: Discussion
sub property of: has informal output
definition: Connects a project with a public discussion, debate contribution, round-table, forum thread, or opinion/commentary piece.

has informal output
type: Property
type: ObjectProperty
domain: Project
range: Informal Output
sub property of: has-output
definition: Connects a project with an informal, grey, or public-facing output produced by or featuring the people working on the project, as opposed to a formal research output.

has media coverage
type: Property
type: ObjectProperty
domain: Project
range: Media Article
sub property of: has informal output
definition: Connects a project with a newspaper, magazine, popular-science, or institutional-news article or interview featuring it.

has podcast
type: Property
type: ObjectProperty
domain: Project
range: Podcast
sub property of: has informal output
definition: Connects a project with a podcast episode hosted by or featuring its people.

has social post
type: Property
type: ObjectProperty
domain: Project
range: Social Media Post
sub property of: has informal output
definition: Connects a project with a microblog or social-media post by or about it.

sig
has algorithm: RSA
signed by: https://orcid.org/0000-0002-1267-0234